dimethylurea

Gas phase ion energetics data

Data compiled by: Sharon G. Lias, Rhoda D. Levin, and Sherif A. Kafafi

Appearance energy determinations

Ion AE (eV) Other Products MethodReferenceComment
CH2NO+13.70?EILoudon and Webb, 1977
C2H6N+11.65?EILoudon and Webb, 1977

References

Loudon and Webb, 1977
Loudon, A.G.; Webb, K.S., The nature of the [C2H6N]+ and [CH4N]+ ions formed by electron impact on methylated formamides, acetamides, ureas, thioureas and hexamethylphosphoramide, Org. Mass Spectrom., 1977, 12, 283. [all data]