1-Pentylnaphthalene

Condensed phase thermochemistry data

Data compiled by: Hussein Y. Afeefy, Joel F. Liebman, and Stephen E. Stein

Quantity Value Units Method Reference Comment
Δcliquid-1920.kcal/molCcbHipsher and Wise, 1954ΔHfusion=5.6 kcal/mol; Corresponding Δfliquid = -106. kcal/mol (simple calculation by NIST; no Washburn corrections)

References

Hipsher and Wise, 1954
Hipsher, H.F.; Wise, P.H., Dicyclic hydrocarbons. VIII. 1-Alkylnaphthalenes and some of their tetrahydro derivatives, J. Am. Chem. Soc., 1954, 76, 1747-1748. [all data]