Carbonic acid, isobutyl phenyl ester

Van Den Dool and Kratz RI, non-polar column, temperature ramp

View large format table.

Column type Active phase I Reference Comment
Capillary5 % Phenyl methyl siloxane1398.Zaikin, 200930. m/0.25 mm/0.25 μm, 15. K/min, 270. C @ 15. min; Tstart: 60. C

Van Den Dool and Kratz RI, non-polar column, custom temperature program

View large format table.

Column type Active phase I Reference Comment
CapillaryDB-51388.Kim and Kim, 200030. m/0.25 mm/0.25 μm, He; Program: 60C(0.7min) => 30C/min => 150C => 5C/min => 280C

References

Zaikin, 2009
Zaikin, V.G., Personal Communication: Retention indices measured during the period 2008 to 2009, 2009. [all data]

Kim and Kim, 2000
Kim, K.-R.; Kim, H., Gas chromatographic profiling and screening for phenols as isobutoxycarbonyl derivatives in aqueous samples, J. Chromatogr. A, 2000, 866, 1, 87-96, https://doi.org/10.1016/S0021-9673(99)01068-7 . [all data]