Iron sulfide

Condensed phase thermochemistry data

Quantity Value Units Method Reference Comment
Δfliquid-16.45kcal/molReviewChase, 1998Data last reviewed in September, 1977
Quantity Value Units Method Reference Comment
liquid,1 bar19.79cal/mol*KReviewChase, 1998Data last reviewed in September, 1977
Quantity Value Units Method Reference Comment
Δfsolid-24.300kcal/molReviewChase, 1998troilite phase; Data last reviewed in September, 1977

Liquid Phase Heat Capacity (Shomate Equation)

Cp° = A + B*t + C*t2 + D*t3 + E/t2
H° − H°298.15= A*t + B*t2/2 + C*t3/3 + D*t4/4 − E/t + F − H
S° = A*ln(t) + B*t + C*t2/2 + D*t3/3 − E/(2*t2) + G
    Cp = heat capacity (cal/mol*K)
    H° = standard enthalpy (kcal/mol)
    S° = standard entropy (cal/mol*K)
    t = temperature (K) / 1000.

View plot Requires a JavaScript / HTML 5 canvas capable browser.

View table.

Temperature (K) 1463. - 3800.
A 14.95000
B 4.738528×10-7
C -1.606267×10-7
D 1.532486×10-8
E -1.028445×10-7
F -20.19878
G 39.73853
H -16.44632
ReferenceChase, 1998
Comment Data last reviewed in September, 1977

Solid Phase Heat Capacity (Shomate Equation)

Cp° = A + B*t + C*t2 + D*t3 + E/t2
H° − H°298.15= A*t + B*t2/2 + C*t3/3 + D*t4/4 − E/t + F − H
S° = A*ln(t) + B*t + C*t2/2 + D*t3/3 − E/(2*t2) + G
    Cp = heat capacity (cal/mol*K)
    H° = standard enthalpy (kcal/mol)
    S° = standard entropy (cal/mol*K)
    t = temperature (K) / 1000.

View plot Requires a JavaScript / HTML 5 canvas capable browser.

View table.

Temperature (K) 298. - 411.411. - 598.598. - 1463.
A 2208.54917.2964422.90339
B -13149.33-0.014496-20.44969
C 29039.670.02879811.64443
D -22272.25-0.018945-0.000024
E -23.74744-0.0000040.000017
F -390.5378-29.19121-29.62381
G 5380.06735.8446549.02844
H -24.29995-24.29995-24.29995
ReferenceChase, 1998Chase, 1998Chase, 1998
Comment troilite phase; Data last reviewed in September, 1977 troilite phase; Data last reviewed in September, 1977 troilite phase; Data last reviewed in September, 1977

Gas phase thermochemistry data

Quantity Value Units Method Reference Comment
Δfgas88.616kcal/molReviewChase, 1998Data last reviewed in September, 1977
Quantity Value Units Method Reference Comment
gas,1 bar60.306cal/mol*KReviewChase, 1998Data last reviewed in September, 1977

Gas Phase Heat Capacity (Shomate Equation)

Cp° = A + B*t + C*t2 + D*t3 + E/t2
H° − H°298.15= A*t + B*t2/2 + C*t3/3 + D*t4/4 − E/t + F − H
S° = A*ln(t) + B*t + C*t2/2 + D*t3/3 − E/(2*t2) + G
    Cp = heat capacity (cal/mol*K)
    H° = standard enthalpy (kcal/mol)
    S° = standard entropy (cal/mol*K)
    t = temperature (K) / 1000.

View plot Requires a JavaScript / HTML 5 canvas capable browser.

View table.

Temperature (K) 3800. - 6000.
A 9.038829
B -0.233951
C 0.204611
D -0.020285
E -0.079085
F 85.66429
G 70.86061
H 88.61551
ReferenceChase, 1998
Comment Data last reviewed in September, 1977

References

Chase, 1998
Chase, M.W., Jr., NIST-JANAF Themochemical Tables, Fourth Edition, J. Phys. Chem. Ref. Data, Monograph 9, 1998, 1-1951. [all data]