BCO

Vibrational and/or electronic energy levels

Data compiled by: Marilyn E. Jacox

State:   X

Vib.
sym.
 No.   Approximate
 type of mode
 cm-1   Med.   Method   References

Σ+ 1 CO stretch 2002.6 m Ar IR Burkholder and Andrews, 1992
Zhou, Tsumori, et al., 2003
Π 2 Bend 491.3 w Ar IR Zhou, Tsumori, et al., 2003
Σ+ 3 BC stretch 1114.1 w Ar IR Zhou, Tsumori, et al., 2003

Additional references: Jacox, 1994, page 68

References

Burkholder and Andrews, 1992
Burkholder, T.R.; Andrews, L., Reaction of boron atoms with carbon monoxide: matrix infrared spectra of BCO, (BCO)2, and B(CO)2, J. Phys. Chem., 1992, 96, 25, 10195, https://doi.org/10.1021/j100204a020 . [all data]

Zhou, Tsumori, et al., 2003
Zhou, M.; Tsumori, N.; Andrews, L.; Xu, Q., Infrared Spectra of BCO, B(CO), J. Phys. Chem. A, 2003, 107, 14, 2458, https://doi.org/10.1021/jp027229g . [all data]

Jacox, 1994
Jacox, M.E., Vibrational and electronic energy levels of polyatomic transient molecules, American Chemical Society, Washington, DC, 1994, 464. [all data]