CaSCH3

Vibrational and/or electronic energy levels

Data compiled by: Marilyn E. Jacox

State:   B

 Energy
 (cm-1
 Med.   Transition   λmin
 (nm)
 λmax
 (nm)

References

To = 15807 gas Fernando, Ram, et al., 1991

State:   A

 Energy
 (cm-1
 Med.   Transition   λmin
 (nm)
 λmax
 (nm)

To = 15509 gas Fernando, Ram, et al., 1991

Additional references: Jacox, 1994, page 315

Fernando, Ram, et al., 1991
Fernando, W.T.M.L.; Ram, R.S.; O'Brien, L.C.; Bernath, P.F., Gas-phase inorganic chemistry: laser spectroscopy of calcium and strontium monothiolates and monohydrosulfides, J. Phys. Chem., 1991, 95, 7, 2665, https://doi.org/10.1021/j100160a009 . [all data]

Jacox, 1994
Jacox, M.E., Vibrational and electronic energy levels of polyatomic transient molecules, American Chemical Society, Washington, DC, 1994, 464. [all data]