dicopper oxide

Condensed phase thermochemistry data

Quantity Value Units Method Reference Comment
Δfliquid-112.00kJ/molReviewChase, 1998Data last reviewed in December, 1977
Quantity Value Units Method Reference Comment
liquid,1 bar129.96J/mol*KReviewChase, 1998Data last reviewed in December, 1977
Quantity Value Units Method Reference Comment
Δfsolid-170.71kJ/molReviewChase, 1998Data last reviewed in December, 1977
Quantity Value Units Method Reference Comment
solid92.37J/mol*KReviewChase, 1998Data last reviewed in December, 1977

Liquid Phase Heat Capacity (Shomate Equation)

Cp° = A + B*t + C*t2 + D*t3 + E/t2
H° − H°298.15= A*t + B*t2/2 + C*t3/3 + D*t4/4 − E/t + F − H
S° = A*ln(t) + B*t + C*t2/2 + D*t3/3 − E/(2*t2) + G
    Cp = heat capacity (J/mol*K)
    H° = standard enthalpy (kJ/mol)
    S° = standard entropy (J/mol*K)
    t = temperature (K) / 1000.

View plot Requires a JavaScript / HTML 5 canvas capable browser.

View table.

Temperature (K) 1517. - 2000.
A 95.39980
B 4.892490
C -1.982781
D 0.284974
E 1.522601
F -155.9270
G 213.9270
H -111.9950
ReferenceChase, 1998
Comment Data last reviewed in December, 1977

Solid Phase Heat Capacity (Shomate Equation)

Cp° = A + B*t + C*t2 + D*t3 + E/t2
H° − H°298.15= A*t + B*t2/2 + C*t3/3 + D*t4/4 − E/t + F − H
S° = A*ln(t) + B*t + C*t2/2 + D*t3/3 − E/(2*t2) + G
    Cp = heat capacity (J/mol*K)
    H° = standard enthalpy (kJ/mol)
    S° = standard entropy (J/mol*K)
    t = temperature (K) / 1000.

View plot Requires a JavaScript / HTML 5 canvas capable browser.

View table.

Temperature (K) 298. - 1100.1100. - 1516.7
A 59.4203328.82153
B 37.8476739.81603
C -26.450831.459388
D 11.07609-0.256110
E -0.54218011.30291
F -191.7109-156.7167
G 151.0177144.7999
H -170.7072-170.7072
ReferenceChase, 1998Chase, 1998
Comment Data last reviewed in December, 1977 Data last reviewed in December, 1977

Gas phase ion energetics data

Data compiled by: John E. Bartmess

Electron affinity determinations

EA (eV) Method Reference Comment
1.100 ± 0.030LPESWang, Wu, et al., 1996

Vibrational and/or electronic energy levels

Data compiled by: Marilyn E. Jacox

State:   D

 Energy
 (cm-1
 Med.   Transition   λmin
 (nm)
 λmax
 (nm)

References

Chase, 1998
Chase, M.W., Jr., NIST-JANAF Themochemical Tables, Fourth Edition, J. Phys. Chem. Ref. Data, Monograph 9, 1998, 1-1951. [all data]