3-Heptene, 5-methyl-

Kovats' RI, non-polar column, isothermal

Data compiled by: NIST Mass Spectrometry Data Center, William E. Wallace, director

Column type CapillaryCapillaryCapillary
Active phase Petrocol DHSqualaneSqualane
Column length (m) 150.93.120.
Carrier gas H2HeHe
Substrate
Column diameter (mm) 0.250.250.25
Phase thickness (μm) 1.
Temperature (C) 30.30.55.
I 766.753.7765.5
ReferenceSoják, Addová, et al., 2004Soják, Addová, et al., 2004Lulova, Leont'eva, et al., 1975
Comment MSDC-RI MSDC-RI MSDC-RI

References

Soják, Addová, et al., 2004
Soják, L.; Addová, G.; Kubinec, R.; Kraus, A.; Bohác, A., Capillary gas chromatography-mass spectrometry of all 93 acyclic octenes and their identification in fluid catalytic cracked gasoline, J. Chromatogr. A, 2004, 1025, 2, 237-253, https://doi.org/10.1016/j.chroma.2003.10.112 . [all data]

Lulova, Leont'eva, et al., 1975
Lulova, N.I.; Leont'eva, S.A.; Fedosova, A.K.; Kvasova, V.A., Individual composition of hydrocarbons in naphthas from secondary processes, Chem. Technol. Fuels Oils (Engl. Transl.), 1975, 11, 1/2, 59-64, https://doi.org/10.1007/BF00717315 . [all data]