strontium sulphide

Gas phase thermochemistry data

Quantity Value Units Method Reference Comment
Δfgas108.20kJ/molReviewChase, 1998Data last reviewed in September, 1977
Quantity Value Units Method Reference Comment
gas,1 bar243.11J/mol*KReviewChase, 1998Data last reviewed in September, 1977

Gas Phase Heat Capacity (Shomate Equation)

Cp° = A + B*t + C*t2 + D*t3 + E/t2
H° − H°298.15= A*t + B*t2/2 + C*t3/3 + D*t4/4 − E/t + F − H
S° = A*ln(t) + B*t + C*t2/2 + D*t3/3 − E/(2*t2) + G
    Cp = heat capacity (J/mol*K)
    H° = standard enthalpy (kJ/mol)
    S° = standard entropy (J/mol*K)
    t = temperature (K) / 1000.

View plot Requires a JavaScript / HTML 5 canvas capable browser.

View table.

Temperature (K) 298. - 1500.1500. - 3000.3000. - 6000.
A 32.79084-216.1994404.9091
B 16.69542194.3660-146.3295
C -21.13556-41.5861621.70249
D 9.5133712.198743-1.131857
E -0.058492119.7578-587.5340
F 97.65121383.4063-684.7116
G 278.3393170.6566216.2668
H 108.1982108.1982108.1982
ReferenceChase, 1998Chase, 1998Chase, 1998
Comment Data last reviewed in September, 1977 Data last reviewed in September, 1977 Data last reviewed in September, 1977

Condensed phase thermochemistry data

Quantity Value Units Method Reference Comment
Δfsolid-468.61kJ/molReviewChase, 1998Data last reviewed in September, 1977
Quantity Value Units Method Reference Comment
solid68.32J/mol*KReviewChase, 1998Data last reviewed in September, 1977

Solid Phase Heat Capacity (Shomate Equation)

Cp° = A + B*t + C*t2 + D*t3 + E/t2
H° − H°298.15= A*t + B*t2/2 + C*t3/3 + D*t4/4 − E/t + F − H
S° = A*ln(t) + B*t + C*t2/2 + D*t3/3 − E/(2*t2) + G
    Cp = heat capacity (J/mol*K)
    H° = standard enthalpy (kJ/mol)
    S° = standard entropy (J/mol*K)
    t = temperature (K) / 1000.

View plot Requires a JavaScript / HTML 5 canvas capable browser.

View table.

Temperature (K) 298. - 3000.
A 48.78126
B 9.579728
C -2.396596
D 0.404882
E -0.253551
F -484.4361
G 123.1761
H -468.6080
ReferenceChase, 1998
Comment Data last reviewed in September, 1977

Constants of diatomic molecules

Data compiled by: Klaus P. Huber and Gerhard H. Herzberg

Data collected through September, 1977

Symbols used in the table of constants
SymbolMeaning
State electronic state and / or symmetry symbol
Te minimum electronic energy (cm-1)
ωe vibrational constant – first term (cm-1)
ωexe vibrational constant – second term (cm-1)
ωeye vibrational constant – third term (cm-1)
Be rotational constant in equilibrium position (cm-1)
αe rotational constant – first term (cm-1)
γe rotation-vibration interaction constant (cm-1)
De centrifugal distortion constant (cm-1)
βe rotational constant – first term, centrifugal force (cm-1)
re internuclear distance (Å)
Trans. observed transition(s) corresponding to electronic state
ν00 position of 0-0 band (units noted in table)
Diatomic constants for 88Sr32S
StateTeωeωexeωeyeBeαeγeDeβereTrans.ν00
B 1Σ+ 39332.1 286.80 Z 0.84  0.10566 1 0.000320  0.575E-7  2.6087 B ← X R 39281.42 Z
missing citation
X 1Σ+ 0 388.38 Z 1.31  0.12072 0.000440  0.475E-7  2.4405

References

Chase, 1998
Chase, M.W., Jr., NIST-JANAF Themochemical Tables, Fourth Edition, J. Phys. Chem. Ref. Data, Monograph 9, 1998, 1-1951. [all data]

Marquart and Berkowitz, 1963
Marquart, J.R.; Berkowitz, J., Dissociation energies of some metal sulfides, J. Chem. Phys., 1963, 39, 283. [all data]

Colin, Goldfinger, et al., 1964
Colin, R.; Goldfinger, P.; Jeunehomme, M., Mass-spectrometric studies of vaporization of the sulphides of calcium, strontium and barium. The dissociation energy of S2 and SO, Trans. Faraday Soc., 1964, 60, 306. [all data]

Cater and Johnson, 1967
Cater, E.D.; Johnson, E.W., Sublimation of strontium sulfide and the dissociation energy of SrS, J. Chem. Phys., 1967, 47, 5353. [all data]