tetraphosphorus trisulphide

Condensed phase thermochemistry data

Quantity Value Units Method Reference Comment
Δfliquid-52.768kcal/molReviewChase, 1998Data last reviewed in December, 1960
Quantity Value Units Method Reference Comment
liquid,1 bar49.498cal/mol*KReviewChase, 1998Data last reviewed in December, 1960
Quantity Value Units Method Reference Comment
Δfsolid-53.693kcal/molReviewChase, 1998Data last reviewed in December, 1960
Quantity Value Units Method Reference Comment
solid48.000cal/mol*KReviewChase, 1998Data last reviewed in December, 1960

Liquid Phase Heat Capacity (Shomate Equation)

Cp° = A + B*t + C*t2 + D*t3 + E/t2
H° − H°298.15= A*t + B*t2/2 + C*t3/3 + D*t4/4 − E/t + F − H
S° = A*ln(t) + B*t + C*t2/2 + D*t3/3 − E/(2*t2) + G
    Cp = heat capacity (cal/mol*K)
    H° = standard enthalpy (kcal/mol)
    S° = standard entropy (cal/mol*K)
    t = temperature (K) / 1000.

View plot Requires a JavaScript / HTML 5 canvas capable browser.

View table.

Temperature (K) 440. - 3000.
A 44.00000
B 0.000000
C 0.000000
D 0.000000
E 0.000000
F -65.88731
G 102.7440
H -52.76869
ReferenceChase, 1998
Comment Data last reviewed in December, 1960

Solid Phase Heat Capacity (Shomate Equation)

Cp° = A + B*t + C*t2 + D*t3 + E/t2
H° − H°298.15= A*t + B*t2/2 + C*t3/3 + D*t4/4 − E/t + F − H
S° = A*ln(t) + B*t + C*t2/2 + D*t3/3 − E/(2*t2) + G
    Cp = heat capacity (cal/mol*K)
    H° = standard enthalpy (kcal/mol)
    S° = standard entropy (cal/mol*K)
    t = temperature (K) / 1000.

View plot Requires a JavaScript / HTML 5 canvas capable browser.

View table.

Temperature (K) 298. - 440.
A 35.00000
B -2.010641×10-9
C 1.630610×10-9
D -4.174580×10-10
E -3.103182×10-11
F -64.12720
G 90.35569
H -53.69199
ReferenceChase, 1998
Comment Data last reviewed in December, 1960

References

Chase, 1998
Chase, M.W., Jr., NIST-JANAF Themochemical Tables, Fourth Edition, J. Phys. Chem. Ref. Data, Monograph 9, 1998, 1-1951. [all data]