1,4,6,9-Tetrathiaspiro[4.4]nonane
- Formula: C5H8S4
- Molecular weight: 196.377
- IUPAC Standard InChIKey: OIXFQRVSKVVDFW-UHFFFAOYSA-N
- CAS Registry Number: 13145-46-5
- Chemical structure:

Gas phase ion energetics data

Data compiled by: Sharon G. Lias, Rhoda D. Levin, and Sherif A. Kafafi
Ionization energy determinations
IE (eV) | Method | Reference | Comment |
---|---|---|---|
8.26 | PE | Kobayashi, Gleiter, et al., 1977 | Vertical value |
8.35 | PE | Baker, Brisk, et al., 1976 | Vertical value |

References

Kobayashi, Gleiter, et al., 1977
Kobayashi, M.; Gleiter, R.; Coffen, D.L.; Bock, H.; Schulz, W.; Stein, U.,
Spiroconjugation in orthothiocarbonates,
Tetrahedron, 1977, 33, 433. [all data]
Baker, Brisk, et al., 1976
Baker, A.D.; Brisk, M.A.; Venanzi, T.J.; Kwon, Y.S.; Sadka, S.,
Spiroconjugation involving sulfur 3p atomic orbitals,
Tetrahedron Lett., 1976, 38, 3415. [all data]