Diphosphorus trioxide

Gas phase ion energetics data

Data compiled by: Sharon G. Lias, Rhoda D. Levin, and Sherif A. Kafafi

Ionization energy determinations

IE (eV) Method Reference
10.4 ± 0.5EISmoes and Drowart, 1973

Appearance energy determinations

Ion AE (eV) Other Products MethodReferenceComment
OP+13.5 ± 1.0?EISmoes and Drowart, 1973
O2P+15.4 ± 1.0?EISmoes and Drowart, 1973

References

Smoes and Drowart, 1973
Smoes, S.; Drowart, J., Atomization energies of phosphorus oxides, Faraday Symp. Chem. Soc., 1973, 139. [all data]