zirconium dioxide
- Formula: O2Zr
- Molecular weight: 123.223
- CAS Registry Number: 1314-23-4

Gas phase thermochemistry data

Quantity | Value | Units | Method | Reference | Comment |
---|---|---|---|---|---|
ΔfH°gas | -68.401 | kcal/mol | Review | Chase, 1998 | Data last reviewed in December, 1965 |
Quantity | Value | Units | Method | Reference | Comment |
S°gas,1 bar | 65.425 | cal/mol*K | Review | Chase, 1998 | Data last reviewed in December, 1965 |
Gas Phase Heat Capacity (Shomate Equation)
Cp° = A + B*t + C*t2 + D*t3 +
E/t2
H° − H°298.15= A*t + B*t2/2 +
C*t3/3 + D*t4/4 − E/t + F − H
S° = A*ln(t) + B*t + C*t2/2 + D*t3/3 −
E/(2*t2) + G
Cp = heat capacity (cal/mol*K)
H° = standard enthalpy (kcal/mol)
S° = standard entropy (cal/mol*K)
t = temperature (K) / 1000.
View plot Requires a JavaScript / HTML 5 canvas capable browser.
Temperature (K) | 5000. to 6000. |
---|---|
A | 13.85430 |
B | 0.032608 |
C | -0.006794 |
D | 0.000480 |
E | -0.439971 |
F | -73.80581 |
G | 80.23939 |
H | -68.40019 |
Reference | Chase, 1998 |
Comment | Data last reviewed in December, 1965 |

Gas phase ion energetics data

Data compiled as indicated in comments:
LLK - Sharon G. Lias, Rhoda D. Levin, and Sherif A. Kafafi
RDSH - Henry M. Rosenstock, Keith Draxl, Bruce W. Steiner, and John T. Herron
Ionization energy determinations
IE (eV) | Method | Reference | Comment |
---|---|---|---|
9.4 ± 0.2 | EI | Murad and Hildenbrand, 1975 | LLK |
9.6 ± 0.1 | EI | Rauh and Ackermann, 1974 | LLK |
8. ± 0.5 | EI | Chupka, Berkowitz, et al., 1957 | RDSH |

References

Chase, 1998
Chase, M.W., Jr.,
NIST-JANAF Themochemical Tables, Fourth Edition,
J. Phys. Chem. Ref. Data, Monograph 9, 1998, 1-1951. [all data]
Murad and Hildenbrand, 1975
Murad, E.; Hildenbrand, D.L.,
Thermochemical properties of gaseous ZrO and ZrO2,
J. Chem. Phys., 1975, 63, 1133. [all data]
Rauh and Ackermann, 1974
Rauh, E.G.; Ackermann, R.J.,
First ionization potentials of some refractory oxide vapors,
J. Chem. Phys., 1974, 60, 1396. [all data]
Chupka, Berkowitz, et al., 1957
Chupka, W.A.; Berkowitz, J.; Inghram, M.G.,
Thermodynamics of the Zr-ZrO, system: the dissociation energies of ZrO and ZrO2,
J. Chem. Phys., 1957, 26, 1207. [all data]