Benzene, 1,1'-(1-buten-3-yne-1,4-diyl)bis-

Gas phase ion energetics data

Data compiled as indicated in comments:
LLK - Sharon G. Lias, Rhoda D. Levin, and Sherif A. Kafafi

Ionization energy determinations

IE (eV) Method Reference Comment
7.5PEAndreocci, Bicev, et al., 1980LLK
7.99PEAndreocci, Bicev, et al., 1980Vertical value; LLK

References

Andreocci, Bicev, et al., 1980
Andreocci, M.V.; Bicev, P.; Cauletti, C.; Piancastelli, M.N., The electronic structure of the .PI.-systems of acetylenic oligomers and related substances: An UPS study of diphenylbutadiyne and diphenylbutenyne, Gazz. Chim. Ital., 1980, 110, 31. [all data]