Strontium monoxide

Gas phase thermochemistry data

Quantity Value Units Method Reference Comment
Δfgas-13.39kJ/molReviewChase, 1998Data last reviewed in December, 1972
Quantity Value Units Method Reference Comment
gas,1 bar230.05J/mol*KReviewChase, 1998Data last reviewed in December, 1972

Gas Phase Heat Capacity (Shomate Equation)

Cp° = A + B*t + C*t2 + D*t3 + E/t2
H° − H°298.15= A*t + B*t2/2 + C*t3/3 + D*t4/4 − E/t + F − H
S° = A*ln(t) + B*t + C*t2/2 + D*t3/3 − E/(2*t2) + G
    Cp = heat capacity (J/mol*K)
    H° = standard enthalpy (kJ/mol)
    S° = standard entropy (J/mol*K)
    t = temperature (K) / 1000.

View plot Requires a JavaScript / HTML 5 canvas capable browser.

View table.

Temperature (K) 5000. - 6000.
A 315.7110
B -97.71980
C 13.25990
D -0.636191
E -535.8500
F -683.4350
G 186.3250
H -13.38880
ReferenceChase, 1998
Comment Data last reviewed in December, 1972

Condensed phase thermochemistry data

Quantity Value Units Method Reference Comment
Δfliquid-517.29kJ/molReviewChase, 1998Data last reviewed in December, 1972
Quantity Value Units Method Reference Comment
liquid,1 bar80.82J/mol*KReviewChase, 1998Data last reviewed in December, 1972
Quantity Value Units Method Reference Comment
Δfsolid-592.04kJ/molReviewChase, 1998Data last reviewed in December, 1972
Quantity Value Units Method Reference Comment
solid55.42J/mol*KReviewChase, 1998Data last reviewed in December, 1972

Liquid Phase Heat Capacity (Shomate Equation)

Cp° = A + B*t + C*t2 + D*t3 + E/t2
H° − H°298.15= A*t + B*t2/2 + C*t3/3 + D*t4/4 − E/t + F − H
S° = A*ln(t) + B*t + C*t2/2 + D*t3/3 − E/(2*t2) + G
    Cp = heat capacity (J/mol*K)
    H° = standard enthalpy (kJ/mol)
    S° = standard entropy (J/mol*K)
    t = temperature (K) / 1000.

View plot Requires a JavaScript / HTML 5 canvas capable browser.

View table.

Temperature (K) 2938. - 5000.
A 66.94400
B 1.160633×10-7
C -2.612763×10-8
D 2.031095×10-9
E 1.773461×10-7
F -554.8528
G 137.4013
H -517.2930
ReferenceChase, 1998
Comment Data last reviewed in December, 1972

Solid Phase Heat Capacity (Shomate Equation)

Cp° = A + B*t + C*t2 + D*t3 + E/t2
H° − H°298.15= A*t + B*t2/2 + C*t3/3 + D*t4/4 − E/t + F − H
S° = A*ln(t) + B*t + C*t2/2 + D*t3/3 − E/(2*t2) + G
    Cp = heat capacity (J/mol*K)
    H° = standard enthalpy (kJ/mol)
    S° = standard entropy (J/mol*K)
    t = temperature (K) / 1000.

View plot Requires a JavaScript / HTML 5 canvas capable browser.

View table.

Temperature (K) 298. - 2938.
A 48.55114
B 8.748034
C -0.893966
D 0.115057
E -0.507804
F -608.6339
G 108.7489
H -592.0360
ReferenceChase, 1998
Comment Data last reviewed in December, 1972

Phase change data

Antoine Equation Parameters

log10(P) = A − (B / (T + C))
    P = vapor pressure (bar)
    T = temperature (K)

View plot Requires a JavaScript / HTML 5 canvas capable browser.

Temperature (K) A B C Reference Comment
2341. - 2683.4.79459937.521-1045.447Stull, 1947Coefficents calculated by NIST from author's data.

Constants of diatomic molecules

Data compiled by: Klaus P. Huber and Gerhard H. Herzberg

Data collected through September, 1977

Symbols used in the table of constants
SymbolMeaning
State electronic state and / or symmetry symbol
Te minimum electronic energy (cm-1)
ωe vibrational constant – first term (cm-1)
ωexe vibrational constant – second term (cm-1)
ωeye vibrational constant – third term (cm-1)
Be rotational constant in equilibrium position (cm-1)
αe rotational constant – first term (cm-1)
γe rotation-vibration interaction constant (cm-1)
De centrifugal distortion constant (cm-1)
βe rotational constant – first term, centrifugal force (cm-1)
re internuclear distance (Å)
Trans. observed transition(s) corresponding to electronic state
ν00 position of 0-0 band (units noted in table)
Diatomic constants for 88Sr16O
StateTeωeωexeωeyeBeαeγeDeβereTrans.ν00
C 1Σ+ 28632.7 480.2 Z 2.6  0.2742 1 0.0021  3.5E-7  2.131 C → X 2 R 28546.43 Z
Mahanti, 1932; missing citation
B 1Π 24701.0 519.91 Z 3.24  0.2937 0.0015  5.0E-7  2.059 B → X 2 R 24634.4 Z
Mahanti, 1932; missing citation; Deezsi, Koczkas, et al., 1954
Unclassified bands in the regions 14700 - 15700 and 16600 - 16900 cm-1. The emitter of these bands has long been in doubt Charton and Gaydon, 1956 Pearse and Gaydon, 1976; in flames, and in arcs in water vapour, strong bands attributed to SrOH ocur in the same regions Lagerqvist and Huldt, 1955 Huldt and Lagerqvist, 1956. The bands have recently been observed in dry Sr + N2O + CO (or N2*) flames, both in emission and in absorption Benard, Slafer, et al., 1977 Eckstrom, Barker, et al., 1977 missing citation, and have tentatively been attributed to the transitions 3Δ ↔ a 3Π and 1Δ, 1Σ- ↔ A' 1Π or SrO.
A 1Σ+ 10886.59 619.58 Z 0.89 3  0.30471 4 0.00112  3.2E-7  2.0219 A → X 5 R 10870.40 Z
missing citation; missing citation; Almkvist and Lagerqvist, 1950; missing citation; missing citation; Brewer and Hauge, 1968
StateTeωeωexeωeyeBeαeγeDeβereTrans.ν00
A' 1Π 9400 472.8 6 H 2.06  0.2565 7 0.0017    2.204 A' → X R 9310 H
Capelle, Broida, et al., 1975; Hecht, 1976
a 3Πi 9149 8 463.5 1.61  0.2584 0.0020    2.196
X 1Σ+ 0 653.49 Z 3.96  0.337980 0.002194  3.6E-7  1.91983 9
Ault and Andrews, 1975
Microwave and rf sp. 10 11
Kaufman, Wharton, et al., 1965

References

Chase, 1998
Chase, M.W., Jr., NIST-JANAF Themochemical Tables, Fourth Edition, J. Phys. Chem. Ref. Data, Monograph 9, 1998, 1-1951. [all data]

Stull, 1947
Stull, Daniel R., Vapor Pressure of Pure Substances. Organic and Inorganic Compounds, Ind. Eng. Chem., 1947, 39, 4, 517-540, https://doi.org/10.1021/ie50448a022 . [all data]

Mahanti, 1932
Mahanti, P.C., The band spectra of MgO, CaO and SrO, Phys. Rev., 1932, 42, 609. [all data]

Deezsi, Koczkas, et al., 1954
Deezsi, I.; Koczkas, E.; Matrai, T., Rotationsanalyse einiger blauen Banden des SrO-Molekuls, Acta Phys. Acad. Sci. Hung., 1954, 3, 95. [all data]

Charton and Gaydon, 1956
Charton, M.; Gaydon, A.G., Band spectra emitted by strontium and barium in arcs and flames, Proc. Phys. Soc. London Sect. A, 1956, 69, 520. [all data]

Pearse and Gaydon, 1976
Pearse, R.W.B.; Gaydon, A.G., The identification of molecular spectra, Pub. London - 4th Edition, Chapman and Hall, John Wiley & Sons, Inc., New York, 1976, 0. [all data]

Lagerqvist and Huldt, 1955
Lagerqvist, A.; Huldt, L., Die Trager der Flammenspektren der Erdalkalimetalle, Die Naturwissenschaften, 1955, 42, 365. [all data]

Huldt and Lagerqvist, 1956
Huldt, L.; Lagerqvist, A., Zum Ursprung der Bandenspektren von Calcium und Strontium, Ark. Fys., 1956, 11, 347. [all data]

Benard, Slafer, et al., 1977
Benard, D.J.; Slafer, W.D.; Hecht, J., Chain reaction chemiluminescence of alkaline earth catalyzed N2O-CO flames, J. Chem. Phys., 1977, 66, 1012. [all data]

Eckstrom, Barker, et al., 1977
Eckstrom, D.J.; Barker, J.R.; Hawley, J.G.; Reilly, J.P., Intracavity dye laser spectroscopy studies of the Ba + N2O, Ca + N2O + CO, and Sr + N2O + CO reactions, Appl. Opt., 1977, 16, 2102. [all data]

Almkvist and Lagerqvist, 1950
Almkvist, G.; Lagerqvist, A., Perturbations in the infra-red bands of SrO, Ark. Fys., 1950, 2, 233. [all data]

Brewer and Hauge, 1968
Brewer, L.; Hauge, R., Near infrared bands of diatomic CaO and SrO, J. Mol. Spectrosc., 1968, 25, 330. [all data]

Capelle, Broida, et al., 1975
Capelle, G.A.; Broida, H.P.; Field, R.W., Photon yields of several reactions producing diatomic strontium oxide and halides, and SrO (A'1Π-X1Σ): a new band system, J. Chem. Phys., 1975, 62, 3131. [all data]

Hecht, 1976
Hecht, J., Vibrational analysis of the A'1Π state of strontium oxide using two isotopes, J. Chem. Phys., 1976, 65, 5026. [all data]

Ault and Andrews, 1975
Ault, B.S.; Andrews, L., Nitrogen matrix reactions of alkaline earth metal atoms with ozone: infrared spectra of the alkaline earth metal oxide molecules, J. Chem. Phys., 1975, 62, 2320. [all data]

Kaufman, Wharton, et al., 1965
Kaufman, M.; Wharton, L.; Klemperer, W., Electronic structure of SrO, J. Chem. Phys., 1965, 43, 943. [all data]

Liszt and Smith, 1971
Liszt, H.S.; Smith, Wm.H., RKR Franck-Condon factors for blue and ultraviolet transitions of some metal oxides, J. Quant. Spectrosc. Radiat. Transfer, 1971, 11, 1043. [all data]

Lagerqvist and Selin, 1956
Lagerqvist, A.; Selin, L.-E., Einige ultrarote Banden des SrO Molekules, Ark. Fys., 1956, 11, 323. [all data]

Field, 1974
Field, R.W., Assignment of the lowest 3Π and 1Π states of CaO, SrO, and BaO, J. Chem. Phys., 1974, 60, 2400. [all data]

Nicholls, 1962
Nicholls, R.W., Franck-Condon factors to high vibrational quantum numbers II: SiO, MgO, SrO, AlO, VO, NO, J. Res. Nat. Bur. Stand. Sect. A, 1962, 66, 227. [all data]

Yoshimine, 1968
Yoshimine, Y., Computed ground state properties of BeO, MgO, CaO, and SrO in molecular orbital approximation, J. Phys. Soc. Jpn., 1968, 25, 1100. [all data]