diniobium pentaoxide

Condensed phase thermochemistry data

Quantity Value Units Method Reference Comment
Δfliquid-1830.87kJ/molReviewChase, 1998Data last reviewed in December, 1972
Quantity Value Units Method Reference Comment
liquid,1 bar171.52J/mol*KReviewChase, 1998Data last reviewed in December, 1972
Quantity Value Units Method Reference Comment
Δfsolid-1899.54kJ/molReviewChase, 1998Data last reviewed in December, 1972
Quantity Value Units Method Reference Comment
solid137.30J/mol*KReviewChase, 1998Data last reviewed in December, 1972

Liquid Phase Heat Capacity (Shomate Equation)

Cp° = A + B*t + C*t2 + D*t3 + E/t2
H° − H°298.15= A*t + B*t2/2 + C*t3/3 + D*t4/4 − E/t + F − H
S° = A*ln(t) + B*t + C*t2/2 + D*t3/3 − E/(2*t2) + G
    Cp = heat capacity (J/mol*K)
    H° = standard enthalpy (kJ/mol)
    S° = standard entropy (J/mol*K)
    t = temperature (K) / 1000.

View plot Requires a JavaScript / HTML 5 canvas capable browser.

View table.

Temperature (K) 1785. - 5000.
A 242.2540
B 4.664471×10-7
C 3.382620×10-8
D -1.472301×10-8
E 0.000002
F -1973.480
G 348.6770
H -1830.870
ReferenceChase, 1998
Comment Data last reviewed in December, 1972

Solid Phase Heat Capacity (Shomate Equation)

Cp° = A + B*t + C*t2 + D*t3 + E/t2
H° − H°298.15= A*t + B*t2/2 + C*t3/3 + D*t4/4 − E/t + F − H
S° = A*ln(t) + B*t + C*t2/2 + D*t3/3 − E/(2*t2) + G
    Cp = heat capacity (J/mol*K)
    H° = standard enthalpy (kJ/mol)
    S° = standard entropy (J/mol*K)
    t = temperature (K) / 1000.

View plot Requires a JavaScript / HTML 5 canvas capable browser.

View table.

Temperature (K) 298. - 1785.
A 116.0570
B 117.1810
C -71.76320
D 15.30840
E -1.160891
F -1942.640
G 239.3340
H -1899.540
ReferenceChase, 1998
Comment Data last reviewed in December, 1972

Gas phase ion energetics data

Data compiled by: Sharon G. Lias, John E. Bartmess, Joel F. Liebman, John L. Holmes, Rhoda D. Levin, and W. Gary Mallard

Ionization energy determinations

IE (eV) Method Reference
10. ± 1.EIBalducci, Gigli, et al., 1986

References

Chase, 1998
Chase, M.W., Jr., NIST-JANAF Themochemical Tables, Fourth Edition, J. Phys. Chem. Ref. Data, Monograph 9, 1998, 1-1951. [all data]