disodium oxide

Condensed phase thermochemistry data

Quantity Value Units Method Reference Comment
Δfliquid-372.84kJ/molReviewChase, 1998Data last reviewed in June, 1968
Quantity Value Units Method Reference Comment
liquid,1 bar91.61J/mol*KReviewChase, 1998Data last reviewed in June, 1968
Quantity Value Units Method Reference Comment
Δfsolid-417.98kJ/molReviewChase, 1998Data last reviewed in June, 1968
Quantity Value Units Method Reference Comment
solid75.04J/mol*KReviewChase, 1998Data last reviewed in June, 1968

Liquid Phase Heat Capacity (Shomate Equation)

Cp° = A + B*t + C*t2 + D*t3 + E/t2
H° − H°298.15= A*t + B*t2/2 + C*t3/3 + D*t4/4 − E/t + F − H
S° = A*ln(t) + B*t + C*t2/2 + D*t3/3 − E/(2*t2) + G
    Cp = heat capacity (J/mol*K)
    H° = standard enthalpy (kJ/mol)
    S° = standard entropy (J/mol*K)
    t = temperature (K) / 1000.

View plot Requires a JavaScript / HTML 5 canvas capable browser.

View table.

Temperature (K) 1405.2 - 3000.
A 104.6000
B 9.909135×10-10
C -6.022074×10-10
D 1.113058×10-10
E 2.362827×10-11
F -404.0296
G 218.1902
H -372.8434
ReferenceChase, 1998
Comment Data last reviewed in June, 1968

Solid Phase Heat Capacity (Shomate Equation)

Cp° = A + B*t + C*t2 + D*t3 + E/t2
H° − H°298.15= A*t + B*t2/2 + C*t3/3 + D*t4/4 − E/t + F − H
S° = A*ln(t) + B*t + C*t2/2 + D*t3/3 − E/(2*t2) + G
    Cp = heat capacity (J/mol*K)
    H° = standard enthalpy (kJ/mol)
    S° = standard entropy (J/mol*K)
    t = temperature (K) / 1000.

View plot Requires a JavaScript / HTML 5 canvas capable browser.

View table.

Temperature (K) 298. - 1023.1023. - 1243.1243. - 1405.
A 25.57540-125.77302240.950
B 177.7100302.0740-3209.970
C -166.3350-140.64201803.690
D 57.6116021.32400-359.0730
E 0.33814938.28310-386.2480
F -431.0160-301.6530-1877.630
G 61.79400-42.667002421.660
H -417.9820-417.9820-417.9820
ReferenceChase, 1998Chase, 1998Chase, 1998
Comment Data last reviewed in June, 1968 Data last reviewed in June, 1968 Data last reviewed in June, 1968

References

Chase, 1998
Chase, M.W., Jr., NIST-JANAF Themochemical Tables, Fourth Edition, J. Phys. Chem. Ref. Data, Monograph 9, 1998, 1-1951. [all data]