indium antimonide

Gas phase ion energetics data

Data compiled by: Henry M. Rosenstock, Keith Draxl, Bruce W. Steiner, and John T. Herron

Ionization energy determinations

IE (eV) Method Reference
6.6 ± 0.4EIDeMaria, Drowart, et al., 1959

References

DeMaria, Drowart, et al., 1959
DeMaria, G.; Drowart, J.; Inghram, M.G., Thermodynamic study of InSb with a mass spectrometer, J. Chem. Phys., 1959, 31, 1076. [all data]