Peroxybutyric acid

Phase change data

Data compiled by: William E. Acree, Jr., James S. Chickos

Enthalpy of vaporization

ΔvapH (kJ/mol) Temperature (K) Method Reference Comment
45.5288.AStephenson and Malanowski, 1987Based on data from 273. - 393. K. See also Dykyj, 1971.

References

Stephenson and Malanowski, 1987
Stephenson, Richard M.; Malanowski, Stanislaw, Handbook of the Thermodynamics of Organic Compounds, 1987, https://doi.org/10.1007/978-94-009-3173-2 . [all data]

Dykyj, 1971
Dykyj, J., Petrochemia, 1971, 11, 2, 27. [all data]