2-tert-Butyl-6-methylaniline

Gas phase thermochemistry data

Data compiled by: Hussein Y. Afeefy, Joel F. Liebman, and Stephen E. Stein

Quantity Value Units Method Reference Comment
Δfgas-44.8 ± 3.5kJ/molCcbSuradi, Hacking, et al., 1981

Condensed phase thermochemistry data

Data compiled by: Hussein Y. Afeefy, Joel F. Liebman, and Stephen E. Stein

Quantity Value Units Method Reference Comment
Δfliquid-108.6 ± 2.5kJ/molCcbSuradi, Hacking, et al., 1981
Quantity Value Units Method Reference Comment
Δcliquid-6649.6 ± 2.0kJ/molCcbSuradi, Hacking, et al., 1981

References

Suradi, Hacking, et al., 1981
Suradi, S.; Hacking, J.M.; Pilcher, G.; Gumrukcu, I.; Lappert, M.F., Enthalpies of combustion of five sterically hindered amines, J. Chem. Thermodyn., 1981, 13, 857-861. [all data]