[bis(trifluoromethyl)amino]difluorodichlorophosphorous(V)

Phase change data

Data compiled by: William E. Acree, Jr., James S. Chickos

Enthalpy of vaporization

ΔvapH (kJ/mol) Temperature (K) Reference Comment
32.9293.Emel«65533»us and Onak, 1966Based on data from 262. - 305. K.

References

Emel«65533»us and Onak, 1966
Emel«65533»us, H.J.; Onak, T., Bistrifluoromethylamino-derivatives of phosphorus(V), J. Chem. Soc., A, 1966, 1291, https://doi.org/10.1039/j19660001291 . [all data]