CAS Reg. No. 131026-50-1

Reaction thermochemistry data

Data compiled by: John E. Bartmess

Individual Reactions

(CAS Reg. No. 131026-50-1 • 4294967295Cesium) + Cesium = CAS Reg. No. 131026-50-1

By formula: (CAS Reg. No. 131026-50-1 • 4294967295Cs) + Cs = CAS Reg. No. 131026-50-1

Quantity Value Units Method Reference Comment
Δr44.7 ± 2.6kJ/molN/AMcHugh, Eaton, et al., 1989gas phase; Vertical Detachment Energy: 0.511±0.010 eV

References

McHugh, Eaton, et al., 1989
McHugh, K.M.; Eaton, J.G.; Lee, G.H.; Sarkas, H.W.; Kidder, L.H.; Snodgrass, J.T.; Manaa, M.R.; Bowen, K.H., Photoelectron Spectra of the alkali metal cluster Anions: Na-,n=2-5, K-,n=2-7, Rb-,n=2-3, and Cs-,n=2-3, J. Chem. Phys., 1989, 91, 6, 3792, https://doi.org/10.1063/1.456861 . [all data]