NiD2

Gas phase ion energetics data

Data compiled by: John E. Bartmess

Electron affinity determinations

EA (eV) Method Reference Comment
1.9260 ± 0.0070LPESMiller, Feigerle, et al., 1986

References

Miller, Feigerle, et al., 1986
Miller, A.E.S.; Feigerle, C.S.; Lineberger, W.C., Laser photoelectron spectrocopy of MnH2-, FeH2-, CoH2-, and NiH2-: Determination of the electron affinities for the metal dihydrides, J. Chem. Phys., 1986, 84, 4127. [all data]