TiO2

Gas phase ion energetics data

Data compiled by: John E. Bartmess

Electron affinity determinations

EA (eV) Method Reference Comment
1.58920 ± 0.00050N/AKim, Weichman, et al., 2013
1.590 ± 0.030LPESWu and Wang, 1997

References

Kim, Weichman, et al., 2013
Kim, J.B.; Weichman, M.L.; Neumark, D.M., High-resolution anion photoelectron spectra of TiO2-, ZrO2-, and HfO2- obtained by slow electron velocity- map imaging, Phys. Chem. Chem. Phys., 2013, 15, 48, 20973-20981, https://doi.org/10.1039/c3cp54084g . [all data]

Wu and Wang, 1997
Wu, H.; Wang, L.-S., Electronic Structures of Titanium Oxide Clusters: TiOy (y=1-3) and (TiO2)n (n=1-4), J. Phys. Chem., 1997, 107, 20, 8221, https://doi.org/10.1063/1.475026 . [all data]