Quinine

Kovats' RI, non-polar column, custom temperature program

Data compiled by: NIST Mass Spectrometry Data Center, William E. Wallace, director

Column type PackedPackedPackedPacked
Active phase OV-101OV-1OV-1SE-30
Column length (m) 2.2.2.2.
Carrier gas N2N2N2
Substrate Chromosorb WChromosorb G, AW-DMCSChromosorb G, AW-DMCS
Column diameter (mm)
Phase thickness (μm)
Program not specifiednot specifiednot specifiednot specified
I 2760.2825.2820.2755.
ReferenceMcLinden and Stenhouse, 1979Berninger, Grunnagel, et al., 1975Berninger, Grunnagel, et al., 1975Moffat, Stead, et al., 1974
Comment MSDC-RI MSDC-RI MSDC-RI MSDC-RI

Van Den Dool and Kratz RI, non-polar column, temperature ramp

Data compiled by: NIST Mass Spectrometry Data Center, William E. Wallace, director

Column type CapillaryCapillaryCapillaryPacked
Active phase SPB-1DB-1DB-1SE-30
Column length (m) 30.15.15.1.8
Carrier gas HeHeHeN2
Substrate    Chromosorb W
Column diameter (mm) 0.750.320.25
Phase thickness (μm) 1.00.250.25
Tstart (C) 160.120.120.130.
Tend (C) 280.280.280.290.
Heat rate (K/min) 10.8.8.8.
Initial hold (min)    2.
Final hold (min) 12.5.5.8.
I 2797.2773.2773.2800.
ReferenceChrist, Noomano, et al., 1988Perrigo, Peel, et al., 1985Perrigo, Ballantyne, et al., 1984Perrigo and Peel, 1981
Comment MSDC-RI MSDC-RI MSDC-RI MSDC-RI

References

McLinden and Stenhouse, 1979
McLinden, V.J.; Stenhouse, A.M., A chromatography system for drug identification, Forensic Sci. Int., 1979, 13, 71-79, https://doi.org/10.1016/0379-0738(79)90265-2 . [all data]

Berninger, Grunnagel, et al., 1975
Berninger, H.; Grunnagel, R.; Mall, S.; Moller, M.R., Gas chromatographic identification of unknown substances from body fluids by menas of retention indices, Beitr. Gerichtl. Med., 1975, 33, 185-191. [all data]

Moffat, Stead, et al., 1974
Moffat, A.C.; Stead, A.H.; Smalldon, K.W., Optimum use of paper, thin-layer and gas-liquid chromatography for the identification of basic drugs. III. Gas-liquid chromatography, J. Chromatogr., 1974, 90, 1, 19-33, https://doi.org/10.1016/S0021-9673(01)94770-3 . [all data]