cobalt oxide

Condensed phase thermochemistry data

Quantity Value Units Method Reference Comment
Δfsolid-56.821kcal/molReviewChase, 1998Data last reviewed in December, 1970
Quantity Value Units Method Reference Comment
solid12.63cal/mol*KReviewChase, 1998Data last reviewed in December, 1970

Solid Phase Heat Capacity (Shomate Equation)

Cp° = A + B*t + C*t2 + D*t3 + E/t2
H° − H°298.15= A*t + B*t2/2 + C*t3/3 + D*t4/4 − E/t + F − H
S° = A*ln(t) + B*t + C*t2/2 + D*t3/3 − E/(2*t2) + G
    Cp = heat capacity (cal/mol*K)
    H° = standard enthalpy (kcal/mol)
    S° = standard entropy (cal/mol*K)
    t = temperature (K) / 1000.

View plot Requires a JavaScript / HTML 5 canvas capable browser.

View table.

Temperature (K) 298. - 1600.1600. - 3000.
A 10.432608.595340
B 5.3498403.376530
C -4.0377300.278275
D 1.566961-0.027841
E 0.1272141.233691
F -59.71900-56.83989
G 24.5433125.43110
H -56.82010-56.82010
ReferenceChase, 1998Chase, 1998
Comment Data last reviewed in December, 1970 Data last reviewed in December, 1970

References

Chase, 1998
Chase, M.W., Jr., NIST-JANAF Themochemical Tables, Fourth Edition, J. Phys. Chem. Ref. Data, Monograph 9, 1998, 1-1951. [all data]