Benzene, 1-butoxy-4-[2-(4-fluorophenyl)ethynyl]-

Phase change data

Data compiled by: William E. Acree, Jr., James S. Chickos

Enthalpy of fusion

ΔfusH (kcal/mol) Temperature (K) Method Reference
6.07346.7DSCHsu, Tsay, et al., 1995

References

Hsu, Tsay, et al., 1995
Hsu, C.S.; Tsay, K.T.; Chang, A.C.; Wang, S.R.; Wu, S.T., Synthesis of fluorinated naphthylphenylacetylenic and naphthylphenyldiacetylenic liquid crystals, TLCT, 1995, 19, 4, 409-414, https://doi.org/10.1080/02678299508032000 . [all data]