dichlorotrimethylantimony

Gas phase ion energetics data

Data compiled by: Sharon G. Lias, Rhoda D. Levin, and Sherif A. Kafafi

Ionization energy determinations

IE (eV) Method Reference Comment
9.2PEElbel and tom Dieck, 1981
9.8PEElbel and tom Dieck, 1981Vertical value

References

Elbel and tom Dieck, 1981
Elbel, S.; tom Dieck, H., Die stiborane Me3SbX2 (X = Me, Cl, Br, I) und SbCl5 - im vergleich mit nebengruppenanaloga TaMe5, TaCl5 und NbCl5, Z. Anorg. Allg. Chem., 1981, 483, 33. [all data]