4,4'-Diethylbiphenyl

Phase change data

Data compiled by: Thermodynamics Research Center, NIST Boulder Laboratories, Chris Muzny director

Quantity Value Units Method Reference Comment
Tboil586.3KN/ABuu-Hoi, Hoan, et al., 1950Uncertainty assigned by TRC = 4. K
Quantity Value Units Method Reference Comment
Tfus356.KN/AEveritt, Hall, et al., 1956Uncertainty assigned by TRC = 5. K
Tfus354.KN/ABuu-Hoi, Hoan, et al., 1950Uncertainty assigned by TRC = 4. K
Tfus353.KN/ASchreiner, 1910Uncertainty assigned by TRC = 3. K

In addition to the Thermodynamics Research Center (TRC) data available from this site, much more physical and chemical property data is available from the following TRC products:

Reaction thermochemistry data

Data compiled by: Hussein Y. Afeefy, Joel F. Liebman, and Stephen E. Stein

Individual Reactions

4,4'-Diethylbiphenyl = Biphenyl, 3,4'-diethyl-

By formula: C16H18 = C16H18

Quantity Value Units Method Reference Comment
Δr0.24kJ/molEqkRoshchupkina, Nesterova, et al., 1987liquid phase; T=378.7 K

References

Buu-Hoi, Hoan, et al., 1950
Buu-Hoi, Ng.Ph.; Hoan; Royer, Bull. Soc. Chim. Fr., 1950, 1950, 489. [all data]

Everitt, Hall, et al., 1956
Everitt, P.M.; Hall, D.M.; Turner, E.E., Relation Between Configuration and Conjugation in Biphenyl Derivatives, J. Chem. Soc., 1956, 1956, 2286-90. [all data]

Schreiner, 1910
Schreiner, E., J. Prakt. Chem., 1910, 81, 422. [all data]

Roshchupkina, Nesterova, et al., 1987
Roshchupkina, I.Yu.; Nesterova, T.N.; Rozhnov, A.M., Equilibria of isomeric transformations of alkylbiphenyls, J. Chem. Thermodyn., 1987, 19, 299-306. [all data]