Biphenyl, 3,4'-diethyl-

Reaction thermochemistry data

Data compiled by: Hussein Y. Afeefy, Joel F. Liebman, and Stephen E. Stein

Individual Reactions

3,3'-Diethylbiphenyl = Biphenyl, 3,4'-diethyl-

By formula: C16H18 = C16H18

Quantity Value Units Method Reference Comment
Δr-0.37kJ/molEqkRoshchupkina, Nesterova, et al., 1987liquid phase; T=388.3 K

4,4'-Diethylbiphenyl = Biphenyl, 3,4'-diethyl-

By formula: C16H18 = C16H18

Quantity Value Units Method Reference Comment
Δr0.24kJ/molEqkRoshchupkina, Nesterova, et al., 1987liquid phase; T=378.7 K

References

Roshchupkina, Nesterova, et al., 1987
Roshchupkina, I.Yu.; Nesterova, T.N.; Rozhnov, A.M., Equilibria of isomeric transformations of alkylbiphenyls, J. Chem. Thermodyn., 1987, 19, 299-306. [all data]