N-(3-Methoxyphenyl)benzoic acid amide

Gas phase ion energetics data

Data compiled by: Henry M. Rosenstock, Keith Draxl, Bruce W. Steiner, and John T. Herron

Ionization energy determinations

IE (eV) Method Reference
7.8 ± 0.1EIShapiro, Turk, et al., 1970

Appearance energy determinations

Ion AE (eV) Other Products MethodReferenceComment
C7H5O+10.8 ± 0.1?EIShapiro, Turk, et al., 1970

References

Shapiro, Turk, et al., 1970
Shapiro, R.H.; Turk, J.; Serum, J.W., The effect of substituents on the average internal energy of benzoyl ions generated from N-(substituted-phenyl)benzamides,, Org. Mass Spectrom., 1970, 3, 171. [all data]