Clioquinol

Phase change data

Data compiled by: William E. Acree, Jr., James S. Chickos

Quantity Value Units Method Reference Comment
Δsub114.8 ± 0.4kJ/molMERibeiro da Silva and Monte, 1992Based on data from 359. - 378. K.

Enthalpy of sublimation

ΔsubH (kJ/mol) Temperature (K) Method Reference Comment
111.3 ± 0.4368.MERibeiro da Silva and Monte, 1992Based on data from 359. - 378. K.

References

Ribeiro da Silva and Monte, 1992
Ribeiro da Silva, M.A.V.; Monte, M.J.S., Vapour pressures and enthalpies of sublimation of six halogen-substituted 8-hydroxyquinolines, J. Chem. Thermodyn., 1992, 24, 715-724. [all data]