m-Hydroxybenzophenone

Reaction thermochemistry data

Data compiled by: John E. Bartmess

Individual Reactions

C13H9O2- + Hydrogen cation = m-Hydroxybenzophenone

By formula: C13H9O2- + H+ = C13H10O2

Quantity Value Units Method Reference Comment
Δr1428. ± 8.8kJ/molG+TSFujio, McIver, et al., 1981gas phase; value altered from reference due to change in acidity scale
Quantity Value Units Method Reference Comment
Δr1400. ± 8.4kJ/molIMREFujio, McIver, et al., 1981gas phase; value altered from reference due to change in acidity scale

Gas phase ion energetics data

Data compiled by: John E. Bartmess

De-protonation reactions

C13H9O2- + Hydrogen cation = m-Hydroxybenzophenone

By formula: C13H9O2- + H+ = C13H10O2

Quantity Value Units Method Reference Comment
Δr1428. ± 8.8kJ/molG+TSFujio, McIver, et al., 1981gas phase; value altered from reference due to change in acidity scale
Quantity Value Units Method Reference Comment
Δr1400. ± 8.4kJ/molIMREFujio, McIver, et al., 1981gas phase; value altered from reference due to change in acidity scale

References

Fujio, McIver, et al., 1981
Fujio, M.; McIver, R.T., Jr.; Taft, R.W., Effects on the acidities of phenols from specific substituent-solvent interactions. Inherent substituent parameters from gas phase acidities, J. Am. Chem. Soc., 1981, 103, 4017. [all data]