9-Decen-1-ol

Normal alkane RI, non-polar column, temperature ramp

Data compiled by: NIST Mass Spectrometry Data Center, William E. Wallace, director

Column type CapillaryCapillaryCapillaryCapillary
Active phase HP-1015 % Phenyl methyl siloxaneDB-1DB-1
Column length (m) 25.30.50.50.
Carrier gas HeHeliumN2N2
Substrate
Column diameter (mm) 0.20.250.250.25
Phase thickness (μm) 0.20.250.250.25
Tstart (C) 70.60.95.60.
Tend (C) 200.280.240.240.
Heat rate (K/min) 3.3.4.3.
Initial hold (min) 2.
Final hold (min)  30.
I 1243.1243.1256.1230.
ReferenceJerkovic, Mastelic, et al., 2007Marongiu, Piras, et al., 2006Palá-Paúl, Velasco-Negueruela, et al., 2004Velasco-Negueruela, Pérez-Alonso, et al., 2002
Comment MSDC-RI MSDC-RI MSDC-RI MSDC-RI

References

Jerkovic, Mastelic, et al., 2007
Jerkovic, I.; Mastelic, J.; Marijanovic, Z., Bound volatile compounds and essential oil from the fruit of Maclura pomifera (Raf.) Schneid. (osage orange), Flavour Fragr. J., 2007, 22, 1, 84-88, https://doi.org/10.1002/ffj.1763 . [all data]

Marongiu, Piras, et al., 2006
Marongiu, B.; Piras, A.; Porcedda, S.; Tuveri, E.; Maxia, A., Isolation of Seseli bocconi Guss. volatile oil by supercritical carbon dioxide extraction, Natural Product Research, 2006, 20, 9, 820-826, https://doi.org/10.1080/14786410500364684 . [all data]

Palá-Paúl, Velasco-Negueruela, et al., 2004
Palá-Paúl, J.; Velasco-Negueruela, A.; Pérez-Alonso, M.J.; Maqueda, J.; Sanz, J., Volatile oil constituents from different parts of Cachrys trifida L., J. Essent. Oil Res., 2004, 16, 4, 347-349, https://doi.org/10.1080/10412905.2004.9698738 . [all data]

Velasco-Negueruela, Pérez-Alonso, et al., 2002
Velasco-Negueruela, A.; Pérez-Alonso, M.J.; Palá-Paúl, J.; Íñigo, A.; López, G., Leaf essential oils analysis of Juniperus navicularis Gandoger, Botanica Complutensis, 2002, 26, 85-91. [all data]