2-Methyl-1-hepten-3-ol

Kovats' RI, non-polar column, isothermal

View large format table.

Column type Active phase Temperature (C) I Reference Comment
PackedSE-30100.961.Pías and Gascó, 1975Ar, Chromosorb W AW DMCS HP (80-100 mesh); Column length: 1. m
PackedSE-30120.959.Pías and Gascó, 1975Ar, Chromosorb W AW DMCS HP (80-100 mesh); Column length: 1. m

Normal alkane RI, non-polar column, custom temperature program

View large format table.

Column type Active phase I Reference Comment
CapillaryMethyl Silicone960.Fu and Wang, 2004Program: not specified

References

Pías and Gascó, 1975
Pías, J.B.; Gascó, L., GC Retention Data of Alcohols and Benzoyl Derivatives of Alcohols, J. Chromatogr. - Chrom. Data, 1975, d14-d16. [all data]

Fu and Wang, 2004
Fu, S.-P.; Wang, Y.-Q., Estimation and prediction of gas chromatographic retention indices of alcohols by molecular electronegativity-distance vector, J. Chongqing Univ., 2004, 27, 6, 106-109. [all data]