2-Octenal, 2-butyl-

Normal alkane RI, non-polar column, temperature ramp

Data compiled by: NIST Mass Spectrometry Data Center, William E. Wallace, director

Column type CapillaryCapillaryCapillary
Active phase DB-5HP-1HP-1
Column length (m) 30.30.30.
Carrier gas HeHeHe
Substrate
Column diameter (mm) 0.250.250.25
Phase thickness (μm) 0.250.10.1
Tstart (C) 40.50.50.
Tend (C) 250.300.300.
Heat rate (K/min) 4.5.5.
Initial hold (min) 2.2.2.
Final hold (min) 10.3.3.
I 1355.1363.1363.
ReferenceShen X., Gao Y., et al., 2006Boatright and Crum, 1997Boatright and Crum, 1997
Comment MSDC-RI MSDC-RI MSDC-RI

References

Shen X., Gao Y., et al., 2006
Shen X.; Gao Y.; Su Q.D., Constituents of the essential oil of Rhizoma polygonati, Flavour Fragr. J., 2006, 21, 3, 556-558, https://doi.org/10.1002/ffj.1666 . [all data]

Boatright and Crum, 1997
Boatright, W.L.; Crum, A.D., Nonpolar-volatile lipids from soy protein isolates and hexane-defatted flakes, J. Amer. Oil Chem. Soc., 1997, 74, 4, 461-467, https://doi.org/10.1007/s11746-997-0107-z . [all data]