bis-(4-n-butyl-1'-diazophenyl) isophthalate

Phase change data

Data compiled by: William E. Acree, Jr., James S. Chickos

Enthalpy of fusion

ΔfusH (kcal/mol) Temperature (K) Method Reference
3.82469.2DSCJin, Kang, et al., 1990

References

Jin, Kang, et al., 1990
Jin, J.-I.; Kang, C.-S.; Chung, B.Y., Importance of molecular geometry in liquid crystal formation-incapability of mesophase-formation by bent dimesogenic and star-shaped trimesogenic compounds, Bull. Korean Chem. Soc., 1990, 11, 3, 245. [all data]