C6S6 (A)

Vibrational and/or electronic energy levels

Data compiled by: Marilyn E. Jacox

State:   ?

 Energy
 (cm-1
 Med.   Transition   λmin
 (nm)
 λmax
 (nm)

References

Txd = 21650 Ar Maier, Schrot, et al., 1992

State:   X

Vib.
sym.
 No.   Approximate
 type of mode
 cm-1   Med.   Method   References

1454.1 Ar IR Maier, Schrot, et al., 1992
1440.6 Ar IR Maier, Schrot, et al., 1992
1314.3 Ar IR Maier, Schrot, et al., 1992
1276.7 Ar IR Maier, Schrot, et al., 1992
713.1 Ar IR Maier, Schrot, et al., 1992

Additional references: Jacox, 1994, page 426

Maier, Schrot, et al., 1992
Maier, G.; Schrot, J.; Reisenauer, H.P.; Frenking, G.; Jonas, V., Cyclische C6S6-Isomere --- Matrixspektroskopische und theoretische Untersuchungen, Chem. Ber., 1992, 125, 1, 265, https://doi.org/10.1002/cber.19921250142 . [all data]

Jacox, 1994
Jacox, M.E., Vibrational and electronic energy levels of polyatomic transient molecules, American Chemical Society, Washington, DC, 1994, 464. [all data]