Zirconium,bis(η5-2,4-cyclopentadien-1-yl)diiodo-

Gas phase ion energetics data

Data compiled by: Sharon G. Lias, Rhoda D. Levin, and Sherif A. Kafafi

Ionization energy determinations

IE (eV) Method Reference Comment
8.1 ± 0.1PECauletti, Clark, et al., 1980Vertical value

References

Cauletti, Clark, et al., 1980
Cauletti, C.; Clark, J.P.; Green, J.C.; Jackson, S.E.; Fragala, I.L.; Ciliberto, E.; Coleman, A.W., Photoelectron spectra of bis-cyclopentadienyl metal dihalides, J. Electron Spectrosc. Relat. Phenom., 1980, 18, 61. [all data]