Manganese squarate clathrate

Condensed phase thermochemistry data

Data compiled by: Eugene S. Domalski and Elizabeth D. Hearing

Constant pressure heat capacity of solid

Cp,solid (cal/mol*K) Temperature (K) Reference Comment
168.1299.91Miyazaki and Matsuo, 1990T = 12 to 300 K. Cp value is unsmoothed experimental datum.

References

Miyazaki and Matsuo, 1990
Miyazaki, Y.; Matsuo, T., Thermal and dielectric properties of manganese squarate clathrate compound, Thermochim. Acta, 1990, 163, 225-232. [all data]