5-Phenoxymethyl-3-phenylcarbamoyl-2-oxazolidone

Phase change data

Data compiled by: William E. Acree, Jr., James S. Chickos

Enthalpy of fusion

ΔfusH (kJ/mol) Temperature (K) Reference
12.9415.9Shimasaki, Hayase, et al., 1990

References

Shimasaki, Hayase, et al., 1990
Shimasaki, Choichiro; Hayase, Shuichi; Murai, Atsuko; Takai, Junko; Tsukurimichi, Eiichi; Yoshimura, Toshiaki, Studies on decomposition and formation of triazine series compounds. Part XIII. Thermal behavior and characterization of some 2-oxazolidinone derivatives., Bull. Chem. Soc. Jpn., 1990, 63, 4, 1074-1079, https://doi.org/10.1246/bcsj.63.1074 . [all data]