Ferrocene, 1,1'-bis(methylthio)-

Gas phase ion energetics data

Data compiled by: Sharon G. Lias and Joel F. Liebman

Ionization energy determinations

IE (eV) Method Reference Comment
6.5PEVondrak and Sato, 1989
6.84PEVondrak and Sato, 1989Vertical value

References

Vondrak and Sato, 1989
Vondrak, T.; Sato, M., Orbital interactions in 1,n-dithial[n]ferrocenophanes: a He(I) photoelectron spectroscopic study, J. Organomet. Chem., 1989, 364, 207. [all data]