N-propylstearamide

Phase change data

Data compiled by: William E. Acree, Jr., James S. Chickos

Enthalpy of fusion

ΔfusH (kJ/mol) Temperature (K) Method Reference
50.04354.DSCCypcar, Johnson, et al., 1995

References

Cypcar, Johnson, et al., 1995
Cypcar, C.C.; Johnson, G.; Mathias, L.J., Molecular motions in low molar-mass alkyl amides: models for thermal transitions in polyamides, Polym. Prepr. (Am. Chem. Soc. Div. Polym. Chem.), 1995, 36, 2, 402. [all data]