Bis(η5-cyclopentadienyl)titanium dibromide

Gas phase ion energetics data

Data compiled as indicated in comments:
LBLHLM - Sharon G. Lias, John E. Bartmess, Joel F. Liebman, John L. Holmes, Rhoda D. Levin, and W. Gary Mallard
LLK - Sharon G. Lias, Rhoda D. Levin, and Sherif A. Kafafi

Ionization energy determinations

IE (eV) Method Reference Comment
8.03PEBohm, 1982Vertical value; LBLHLM
8.8 ± 0.1PECauletti, Clark, et al., 1980Vertical value; LLK

References

Bohm, 1982
Bohm, M.C., The photoelectron spectra of bis(cyclopentadienyl)titanium derivatives - a green's function approach, Inorg. Chim. Acta, 1982, 62, 171. [all data]

Cauletti, Clark, et al., 1980
Cauletti, C.; Clark, J.P.; Green, J.C.; Jackson, S.E.; Fragala, I.L.; Ciliberto, E.; Coleman, A.W., Photoelectron spectra of bis-cyclopentadienyl metal dihalides, J. Electron Spectrosc. Relat. Phenom., 1980, 18, 61. [all data]