FeS5 radical

Gas phase ion energetics data

Data compiled by: John E. Bartmess

Electron affinity determinations

EA (eV) Method Reference Comment
3.262 ± 0.010LPESZhai, Kiran, et al., 2003
2.99 ± 0.29LPESNakajima, Hayase, et al., 1997Vertical Detachment Energy: 3.30±.12 eV

References

Zhai, Kiran, et al., 2003
Zhai, H.J.; Kiran, B.; Wang, L.S., Electronic and structural evolution of monoiron sulfur clusters, FeSn- and FeSn (n=1-6), from anion photoelectron spectroscopy, J. Phys. Chem. A, 2003, 107, 16, 2821-2828, https://doi.org/10.1021/jp027867z . [all data]

Nakajima, Hayase, et al., 1997
Nakajima, A.; Hayase, T.; Hayakawa, F.; Kaya, K., Study on Iron-Sulfur Cluster in the Gas-phase: Electronic Structure and Reactivity, Chem. Phys. Lett., 1997, 280, 3-4, 381, https://doi.org/10.1016/S0009-2614(97)01162-7 . [all data]