2-Cyano-2-nitroadamantane

Phase change data

Data compiled as indicated in comments:
ALS - Hussein Y. Afeefy, Joel F. Liebman, and Stephen E. Stein
AC - William E. Acree, Jr., James S. Chickos

Quantity Value Units Method Reference Comment
Δsub70.0 ± 1.9kJ/molVFritzsche, Dogan, et al., 1990ALS

Enthalpy of sublimation

ΔsubH (kJ/mol) Temperature (K) Method Reference Comment
70.0 ± 1.9338.TFritzsche, Dogan, et al., 1990Based on data from 307. - 368. K.; AC

Enthalpy of fusion

ΔfusH (kJ/mol) Temperature (K) Reference Comment
4.98470.2Fritzsche, Dogan, et al., 1990Enthalpy seems low, compound may have lower temperature phase transitions.; AC

References

Fritzsche, Dogan, et al., 1990
Fritzsche, K.; Dogan, B.; Beckhaus, H.D.; Ruechardt, C., Geminal substituents effect. Part I. Thermochemistry of 1-nitro-, 2-nitro-, 2,2-dinitro- and 2-cyano-2-nitroadamantane, Thermochim. Acta, 1990, 160, 147-159. [all data]