1,6-Diselenacyclodeca-3,8-diyne

Gas phase ion energetics data

Data compiled by: Sharon G. Lias and Joel F. Liebman

Ionization energy determinations

IE (eV) Method Reference Comment
8.2PEGleiter, Rittinger, et al., 1991
8.4PEGleiter, Rittinger, et al., 1991Vertical value

References

Gleiter, Rittinger, et al., 1991
Gleiter, R.; Rittinger, S.; Irngartinger, H., Ten-membered heterocyclic diynes X-ray structure analysis and PE-spectroscopic investigations, Chem. Ber., 1991, 124, 365. [all data]