Aluminum fluoride anion

Gas phase thermochemistry data

Data compiled as indicated in comments:
B - John E. Bartmess

Quantity Value Units Method Reference Comment
Δfgas-202.8 ± 7.8kcal/molR-EASrivastava, Uy, et al., 1974EA: 26.5 kcal < EA(F), new EA(F) data used; B
Quantity Value Units Method Reference Comment
gas,1 bar62.132cal/mol*KReviewChase, 1998Data last reviewed in June, 1976

References

Srivastava, Uy, et al., 1974
Srivastava, R.D.; Uy, O.M.; Farber, M., Experimental determination of heats of formation of negative ions and electron affinities of several boron and aluminum fluorides, J. Chem. Soc. Faraday Trans. 1, 1974, 70, 1033. [all data]

Chase, 1998
Chase, M.W., Jr., NIST-JANAF Themochemical Tables, Fourth Edition, J. Phys. Chem. Ref. Data, Monograph 9, 1998, 1-1951. [all data]