(±)1,2-Diphenyl-2-N-piperidinyl-1-ethanone

Phase change data

Data compiled by: William E. Acree, Jr., James S. Chickos

Enthalpy of fusion

ΔfusH (kcal/mol) Temperature (K) Reference
8.109349.2Welle, Verevkin, et al., 1994

References

Welle, Verevkin, et al., 1994
Welle, f.; Verevkin, S.P.; Keller, M.; Beckhaus, H.-D.; Ruchardt, C., Kinetische und thermodynamische Stabilitat von 2,3-Bis(dialkylamino)-1,4-diketonen - Stabilisierungsenergie capto-dativ substituierter α-Dialkylamino-α-Carbonylalkyl-Radikale, Chem. Ber., 1994, 127, 697-710. [all data]