Molybdenum, diethoxy-oxo[tris(3,5-dimethyl-1H-pyrazolato-N')hydroborato(1-)-N2,N2',N2"]-

Gas phase ion energetics data

Data compiled by: Sharon G. Lias and Joel F. Liebman

Ionization energy determinations

IE (eV) Method Reference Comment
6.58 ± 0.02PEChang, Rai-Chaudhuri, et al., 1990Vertical value

References

Chang, Rai-Chaudhuri, et al., 1990
Chang, C.S.J.; Rai-Chaudhuri, A.; Lichtenberger, D.L.; Enemark, J.H., He I valence photoelectron spectra of oxomolybdenum(V) complexes containing diolato or alkoxide ligands, Polyhedron, 1990, 9, 1965. [all data]